{"text_format":"1","workbook":"xlsx","n_sheets":4,"sheets":["Reporte Mensual Consolidado","Reporte uso exclusivo del FNFP","Hoja1","Municipios Dane"],"not_rendered":{"charts":0,"images":2,"macros":1,"external_links":0,"defined_names":48,"comments":0,"pivot_tables":0},"unopened":[],"bounds":{"document_bytes":16777216,"sheet_cells":100000,"rows_first":2000,"rows_last":500,"rows_between":2000,"halvings":0,"cell_chars":16384,"cell_head_chars":4096},"cells_cut":0,"cells_raw":0,"read":"whole","date_system":"1900"}

{"sheet":"Reporte Mensual Consolidado","index":0,"n_rows":80,"n_cols":27,"rows_kept":80,"cut":false,"hidden":false,"merged":[[7,7,7,8],[8,7,8,8],[9,7,9,8],[9,9,9,11],[9,1,9,6],[10,3,10,6],[10,7,10,8],[11,7,11,8],[11,1,11,2],[11,3,11,6],[51,5,51,12],[11,9,11,12],[10,1,10,2],[10,9,10,12],[50,5,50,8],[62,1,62,12],[59,1,59,12],[60,1,60,12],[61,1,61,12],[58,1,58,12],[57,1,57,12],[55,1,56,12],[52,1,52,2],[50,1,51,2],[50,3,51,3],[50,4,51,4],[52,7,52,8],[1,1,1,12],[2,1,2,3],[2,9,2,12],[8,9,8,11],[6,9,6,11],[4,4,4,5],[5,2,5,3],[5,4,5,5],[8,1,8,5],[4,2,4,3],[6,2,6,5],[7,4,7,5],[4,6,5,11],[3,1,3,12],[6,7,6,8],[2,4,2,8],[68,3,68,11],[69,3,69,4],[69,5,69,7],[69,9,69,11],[70,3,70,4],[70,5,70,7],[70,9,70,11],[76,7,76,11],[71,3,71,4],[71,5,71,7],[71,9,71,11],[72,3,72,4],[72,5,72,7],[72,9,72,11],[74,3,74,11],[75,3,75,4],[75,5,75,6],[75,7,75,11],[76,3,76,4],[76,5,76,6],[79,3,79,4],[79,5,79,6],[79,7,79,11],[77,3,77,4],[77,5,77,6],[77,7,77,11],[78,3,78,4],[78,5,78,6],[78,7,78,11]]}
[]
[null,"REPORTE MENSUAL CONSOLIDADO \nCUOTA DE FOMENTO A LA PAPA"]
[null,"VERSIÓN: 04",null,null,"FECHA: 01/08/2021",null,null,null,null,"CÓDIGO: FNFP-F-RC-31-56"]
[null,"En cumplimiento de la Ley Estatutaria 1561 de 2012 de Protección de Datos y normas concordantes, con mi firma autorizo como Titular de los datos personales para que éstos sean incorporados en una base de datos responsabilidad de la FEDERACIÓN COLOMBIANA DE PRODUCTORES DE PAPA-FEDEPAPA y el FONDO NACIONAL DE FOMENTO DE LA PAPA - FNFP, y sean tratados con la finalidad de realizar gestión administrativa, gestión de estadísticas internas, verificación de datos, gestión de recaudos y compras de papa, envío de comunicaciones a través de los medios registrados, mantener, controlar y desarrollar la relación comercial ,gestión de cobros y pagos, transmisión y transferencia de datos con aliados comerciales. Declaro que cuento con la autorización de los terceros registrados en el formato para que su información personal sea incorporada en una base de datos y sea tratada del modo antes mencionado. Es de carácter facultativo suministrar información que verse sobre Datos Sensibles, entendidos como aquellos que afectan la intimidad o generen algún tipo de discriminación o sobre menores de edad. El titular de los datos podrá ejercitar los derechos de acceso, corrección, supresión, revocación o reclamo por infracción sobre sus datos, mediante un escrito dirigido a la FEDERACIÓN COLOMBIANA DE PRODUCTORES DE PAPA-FEDEPAPA. a la dirección de correo electrónico protecciondatos@fedepapa.com indicando en el asunto el derecho que desea ejercitar, o mediante correo ordinario remitido a la dirección Ak 45 No 106B-84 BOGOTÁ D.C"]
[null,null,"MES REPORTADO",null,null,null,"DATOS CONSIGNACIÓN"]
[null,null,"VALOR CANCELADO",null,{"$f":"+M51+M53","v":0}]
[null,null,"FECHA DE ENVÍO",null,null,null,"BANCO",null,null,"FECHA CONSIGNACIÓN"]
[null,null,null,null,null,null,"SUCURSAL"]
[null,"NOMBRE O RAZÓN SOCIAL",null,null,null,null,null,"No. CÉDULA",null,"No. NIT",null,null,"D.V"]
[]
[null,"DEPARTAMENTO:",null,null,null,null,null,"MUNICIPIO:"]
[null,"DIRECCIÓN:",null,null,null,null,null,"TELÉFONO:"]
[null,"FECHA DE COMPRA","NIT/CC\n(Proveedor)","NOMBRE (Proveedor)","DIRECCIÓN  (Proveedor)","TÉLEFONO","DEPARTAMENTO DE ORIGEN DE LA PAPA","MUNICIPIO DE ORIGEN DE LA PAPA","CODIGO MUNICIPIO","VARIEDAD","KILOS COMPRADOS","VALOR COMPRA","VALOR RETENIDO",{"$f":"IF($L13=\"\",\"\",$E$5)","v":0},{"$f":"IF($L13=\"\",\"\",$E$6)","v":0},{"$f":"IF($L13=\"\",\"\",CONCATENATE($C$8,\"/\",$D$8,\"/\",$E$8))","v":"//"},{"$f":"IF($L13=\"\",\"\",$H$7)","v":0},{"$f":"IF($L13=\"\",\"\",$H$8)","v":0},{"$f":"IF($L13=\"\",\"\",CONCATENATE($J$8,\"/\",$K$8,\"/\",$L$8))","v":"//"},{"$f":"IF($L13=\"\",\"\",$B$10)","v":0},{"$f":"IF($L13=\"\",\"\",$H$10)","v":0},{"$f":"IF($L13=\"\",\"\",$J$10)","v":0},{"$f":"IF($L13=\"\",\"\",$M$10)","v":0},{"$f":"IF($L13=\"\",\"\",$D$11)","v":0},{"$f":"IF($L13=\"\",\"\",$J$11)","v":0},{"$f":"IF($L13=\"\",\"\",$D$12)","v":0},{"$f":"IF($L13=\"\",\"\",$J$12)","v":0}]
[null,null,null,null,null,null,null,null,{"$f":"IFERROR(VLOOKUP(H14,'Municipios Dane'!G:H,2,0),\"\")","v":""},null,null,null,{"$f":"+IF(L14=\"\",\"\",L14*0.01)","v":""},"","","",{"$f":"IF($L14=\"\",\"\",$H$7)","v":""},{"$f":"IF($L14=\"\",\"\",$H$8)","v":""},"","","","","","",{"$f":"IF($L14=\"\",\"\",$J$11)","v":""},{"$f":"IF($L14=\"\",\"\",$D$12)","v":""},{"$f":"IF($L14=\"\",\"\",$J$12)","v":""}]
[null,null,null,null,null,null,null,null,{"$f":"IFERROR(VLOOKUP(H15,'Municipios Dane'!G:H,2,0),\"\")","v":""},null,null,null,{"$f":"+IF(L15=\"\",\"\",L15*0.01)","v":""},"","","","","","","","","","","","","",""]
[null,null,null,null,null,null,null,null,{"$f":"IFERROR(VLOOKUP(H16,'Municipios Dane'!G:H,2,0),\"\")","v":""},null,null,null,"","","","","","","","","","","","","","",""]
[null,null,null,null,null,null,null,null,{"$f":"IFERROR(VLOOKUP(H17,'Municipios Dane'!G:H,2,0),\"\")","v":""},null,null,null,"","","","","","","","","","","","","","",""]
[null,null,null,null,null,null,null,null,{"$f":"IFERROR(VLOOKUP(H18,'Municipios Dane'!G:H,2,0),\"\")","v":""},null,null,null,"","","","","","","","","","","","","","",""]
[null,null,null,null,null,null,null,null,{"$f":"IFERROR(VLOOKUP(H19,'Municipios Dane'!G:H,2,0),\"\")","v":""},null,null,null,"","","","","","","","","","","","","","",""]
[null,null,null,null,null,null,null,null,{"$f":"IFERROR(VLOOKUP(H20,'Municipios Dane'!G:H,2,0),\"\")","v":""},null,null,null,"","","","","","","","","","","","","","",""]
{"$rows_left_out":61}
{"sheet":"Reporte uso exclusivo del FNFP","index":1,"n_rows":37,"n_cols":26,"rows_kept":37,"cut":false,"hidden":false,"merged":[]}
["FECHA DE COMPRA","NIT/CC","NOMBRE PROVEEDOR","DIRECCIÓN","TELEFONO","DEPARTAMENTO DE ORIDEN DE LA PAPA","MUNICIPIO DE ORIGEN DE LA PAPA","CODIGO","VARIEDAD","KILOS COMPRADOS","VALOR COMPRA","VALOR RETENIDO","MES REPORTADO","VALOR RECAUDADO","FECHA DE ENVÍO","BANCO","SUCURSAL","FECHA CONSIGNACIÓN","NOMBRE O RAZÓN SOCIAL","No. CÉDULA","No. NIT","D.V.","DEPARTAMENTO:","MUNICIPIO:","DIRECCIÓN:","TELÉFONO:"]
[null,null,null,null,null,null,null,"",null,null,null,"","","","","","","","","","","","","","",""]
[null,null,null,null,null,null,null,"",null,null,null,"","","","","","","","","","","","","","",""]
[null,null,null,null,null,null,null,"",null,null,null,"","","","","","","","","","","","","","",""]
[null,null,null,null,null,null,null,"",null,null,null,"","","","","","","","","","","","","","",""]
[null,null,null,null,null,null,null,"",null,null,null,"","","","","","","","","","","","","","",""]
[null,null,null,null,null,null,null,"",null,null,null,"","","","","","","","","","","","","","",""]
[null,null,null,null,null,null,null,"",null,null,null,"","","","","","","","","","","","","","",""]
[null,null,null,null,null,null,null,"",null,null,null,"","","","","","","","","","","","","","",""]
[null,null,null,null,null,null,null,"",null,null,null,"","","","","","","","","","","","","","",""]
[null,null,null,null,null,null,null,"",null,null,null,"","","","","","","","","","","","","","",""]
[null,null,null,null,null,null,null,"",null,null,null,"","","","","","","","","","","","","","",""]
[null,null,null,null,null,null,null,"",null,null,null,"","","","","","","","","","","","","","",""]
[null,null,null,null,null,null,null,"",null,null,null,"","","","","","","","","","","","","","",""]
[null,null,null,null,null,null,null,"",null,null,null,"","","","","","","","","","","","","","",""]
[null,null,null,null,null,null,null,"",null,null,null,"","","","","","","","","","","","","","",""]
[null,null,null,null,null,null,null,"",null,null,null,"","","","","","","","","","","","","","",""]
[null,null,null,null,null,null,null,"",null,null,null,"","","","","","","","","","","","","","",""]
[null,null,null,null,null,null,null,"",null,null,null,"","","","","","","","","","","","","","",""]
[null,null,null,null,null,null,null,"",null,null,null,"","","","","","","","","","","","","","",""]
{"$rows_left_out":18}
{"sheet":"Hoja1","index":2,"n_rows":55,"n_cols":3,"rows_kept":55,"cut":false,"hidden":true,"merged":[]}
["DAVIVIENDA","Amazonas","Variedades"]
["BOGOTÁ","Antioquia","CRIOLLA"]
["Enero","Arauca","R–12 (DIACOL CAPIRO)"]
["Febrero","Atlantico","PARDA PASTUSA"]
["Marzo","Bogotá","SUPREMA"]
["Abril","Bolivar","SABANERA (TUQUERREÑA)"]
["Mayo","Boyaca","NEVADA"]
["Junio","Caldas","SUPERIOR "]
["Julio","Caqueta","ÚNICA"]
["Agosto","Casanare","PURACÉ"]
["Septiembre","Cauca","BETINA"]
["Octubre","Cesar","PUNTO AZUL"]
["Noviembre","Choco","ROJA NARIÑO"]
["Diciembre","Cordoba","NATIVAS"]
[2017,"Cundinamarca","ESMERALDA"]
[2018,"Guainia","RUBÍ"]
[2019,"Guaviare","OTRA"]
[2020,"Huila"]
[2021,"La Guajira"]
[2022,"Magdalena"]
{"$rows_left_out":36}
{"sheet":"Municipios Dane","index":3,"n_rows":1112,"n_cols":92,"rows_kept":1112,"cut":false,"hidden":true,"merged":[]}
[null,null,null,null,null,null,"MUNICIPIO",null,null,"MUNICIPIO",null,null,"MUNICIPIO",null,null,"MUNICIPIO",null,null,"MUNICIPIO",null,null,"MUNICIPIO",null,null,"MUNICIPIO",null,null,"MUNICIPIO",null,null,"MUNICIPIO",null,null,"MUNICIPIO",null,null,"MUNICIPIO",null,null,"MUNICIPIO",null,null,"MUNICIPIO",null,null,"MUNICIPIO",null,null,"MUNICIPIO",null,null,"MUNICIPIO",null,null,"MUNICIPIO",null,null,"MUNICIPIO",null,null,"MUNICIPIO",null,null,"MUNICIPIO",null,null,"MUNICIPIO",null,null,"MUNICIPIO",null,null,"MUNICIPIO",null,null,"MUNICIPIO",null,null,"MUNICIPIO",null,null,"MUNICIPIO",null,null,"MUNICIPIO",null,null,"MUNICIPIO",null,null,"MUNICIPIO"]
["AMAZONAS",1,"Departamento","Descripcion Municipio","CODIGO","ANTIOQUIA","MEDELLÍN",5001,"ARAUCA","ARAUCA",81001,"ATLÁNTICO","BARRANQUILLA",8001,"BOGOTÁ_DC","BOGOTÁ_DC",11001,"BOLÍVAR","CARTAGENA DE INDIAS",13001,"BOYACÁ","TUNJA",15001,"CALDAS","MANIZALES",17001,"CAQUETÁ","FLORENCIA",18001,"CASANARE","YOPAL",85001,"CAUCA","POPAYÁN",19001,"CESAR","VALLEDUPAR",20001,"CHOCÓ","QUIBDÓ",27001,"CÓRDOBA","MONTERÍA",23001,"CUNDINAMARCA","AGUA DE DIOS",25001,"GUAINÍA","INÍRIDA",94001,"HUILA","NEIVA",41001,"LA_GUAJIRA","RIOHACHA",44001,"MAGDALENA","SANTA MARTA",47001,"META","VILLAVICENCIO",50001,"NARIÑO","PASTO",52001,"NORTE_DE_SANTANDER","SAN JOSÉ DE CÚCUTA",{"$error":"#N/A"},"PUTUMAYO","MOCOA",86001,"QUINDIO","ARMENIA",5059,"RISARALDA","PEREIRA",66001,"SANTANDER","BUCARAMANGA",68001,"SUCRE","SINCELEJO",70001,"TOLIMA","IBAGUÉ",73001,"VALLE_DEL_CAUCA","CALI",76001,"VAUPÉS","MITÚ",97001]
["ANTIOQUIA",2,"AMAZONAS","LETICIA",91001,"ANTIOQUIA","ABEJORRAL",5002,"ARAUCA","ARAUQUITA",81065,"ATLÁNTICO","BARANOA",8078,null,null,null,"BOLÍVAR","ACHÍ",13006,"BOYACÁ","ALMEIDA",15022,"CALDAS","AGUADAS",17013,"CAQUETÁ","ALBANIA",18029,"CASANARE","AGUAZUL",85010,"CAUCA","ALMAGUER",19022,"CESAR","AGUACHICA",20011,"CHOCÓ","ACANDÍ",27006,"CÓRDOBA","AYAPEL",23068,"CUNDINAMARCA","ALBÁN",25019,"GUAINÍA","BARRANCO MINAS",94343,"HUILA","ACEVEDO",41006,"LA_GUAJIRA","ALBANIA",18029,"MAGDALENA","ALGARROBO",47030,"META","ACACÍAS",50006,"NARIÑO","ALBÁN",25019,"NORTE_DE_SANTANDER","ABREGO",54003,"PUTUMAYO","COLÓN",52203,"QUINDIO","BUENAVISTA",15109,"RISARALDA","APÍA",66045,"SANTANDER","AGUADA",68013,"SUCRE","BUENAVISTA",15109,"TOLIMA","ALPUJARRA",73024,"VALLE_DEL_CAUCA","ALCALÁ",76020,"VAUPÉS","CARURU",97161]
["ARAUCA",3,"AMAZONAS","EL ENCANTO",91263,"ANTIOQUIA","ABRIAQUÍ",5004,"ARAUCA","CRAVO NORTE",81220,"ATLÁNTICO","CAMPO DE LA CRUZ",8137,null,null,null,"BOLÍVAR","ALTOS DEL ROSARIO",13030,"BOYACÁ","AQUITANIA",15047,"CALDAS","ANSERMA",17042,"CAQUETÁ","BELÉN DE LOS ANDAQUÍES",18094,"CASANARE","CHAMEZA",85015,"CAUCA","ARGELIA",5055,"CESAR","AGUSTÍN CODAZZI",20013,"CHOCÓ","ALTO BAUDÓ",27025,"CÓRDOBA","BUENAVISTA",15109,"CUNDINAMARCA","ANAPOIMA",25035,"GUAINÍA","MAPIRIPANA",94663,"HUILA","AGRADO",41013,"LA_GUAJIRA","BARRANCAS",44078,"MAGDALENA","ARACATACA",47053,"META","BARRANCA DE UPÍA",50110,"NARIÑO","ALDANA",52022,"NORTE_DE_SANTANDER","ARBOLEDAS",54051,"PUTUMAYO","ORITO",86320,"QUINDIO","CALARCA",63130,"RISARALDA","BALBOA",19075,"SANTANDER","ALBANIA",18029,"SUCRE","CAIMITO",70124,"TOLIMA","ALVARADO",73026,"VALLE_DEL_CAUCA","ANDALUCÍA",76036,"VAUPÉS","PACOA",97511]
["ATLÁNTICO",4,"AMAZONAS","LA CHORRERA",91405,"ANTIOQUIA","ALEJANDRÍA",5021,"ARAUCA","FORTUL",81300,"ATLÁNTICO","CANDELARIA",8141,null,null,null,"BOLÍVAR","ARENAL",13042,"BOYACÁ","ARCABUCO",15051,"CALDAS","ARANZAZU",17050,"CAQUETÁ","CARTAGENA DEL CHAIRÁ",18150,"CASANARE","HATO COROZAL",85125,"CAUCA","BALBOA",19075,"CESAR","ASTREA",20032,"CHOCÓ","ATRATO",27050,"CÓRDOBA","CANALETE",23090,"CUNDINAMARCA","ANOLAIMA",25040,"GUAINÍA","SAN FELIPE",94883,"HUILA","AIPE",41016,"LA_GUAJIRA","DIBULLA",44090,"MAGDALENA","ARIGUANÍ",47058,"META","CABUYARO",50124,"NARIÑO","ANCUYÁ",52036,"NORTE_DE_SANTANDER","BOCHALEMA",54099,"PUTUMAYO","PUERTO ASÍS",86568,"QUINDIO","CIRCASIA",63190,"RISARALDA","BELÉN DE UMBRÍA",66088,"SANTANDER","ARATOCA",68051,"SUCRE","COLOSO",70204,"TOLIMA","AMBALEMA",73030,"VALLE_DEL_CAUCA","ANSERMANUEVO",76041,"VAUPÉS","TARAIRA",97666]
["BOGOTÁ_DC",5,"AMAZONAS","LA PEDRERA",91407,"ANTIOQUIA","AMAGÁ",5030,"ARAUCA","PUERTO RONDÓN",81591,"ATLÁNTICO","GALAPA",8296,null,null,null,"BOLÍVAR","ARJONA",13052,"BOYACÁ","BELÉN",15087,"CALDAS","BELALCÁZAR",17088,"CAQUETÁ","CURILLO",18205,"CASANARE","LA SALINA",85136,"CAUCA","BOLÍVAR",19100,"CESAR","BECERRIL",20045,"CHOCÓ","BAGADÓ",27073,"CÓRDOBA","CERETÉ",23162,"CUNDINAMARCA","ARBELÁEZ",25053,"GUAINÍA","PUERTO COLOMBIA",8573,"HUILA","ALGECIRAS",41020,"LA_GUAJIRA","DISTRACCIÓN",44098,"MAGDALENA","CERRO SAN ANTONIO",47161,"META","CASTILLA LA NUEVA",50150,"NARIÑO","ARBOLEDA",52051,"NORTE_DE_SANTANDER","BUCARASICA",54109,"PUTUMAYO","PUERTO CAICEDO",86569,"QUINDIO","CÓRDOBA",13212,"RISARALDA","DOSQUEBRADAS",66170,"SANTANDER","BARBOSA",5079,"SUCRE","COROZAL",70215,"TOLIMA","ANZOÁTEGUI",73043,"VALLE_DEL_CAUCA","ARGELIA",5055,"VAUPÉS","PAPUNAUA",97777]
["BOLÍVAR",6,"AMAZONAS","LA VICTORIA",91430,"ANTIOQUIA","AMALFI",5031,"ARAUCA","SARAVENA",81736,"ATLÁNTICO","JUAN DE ACOSTA",8372,null,null,null,"BOLÍVAR","ARROYOHONDO",13062,"BOYACÁ","BERBEO",15090,"CALDAS","CHINCHINÁ",17174,"CAQUETÁ","EL DONCELLO",18247,"CASANARE","MANÍ",85139,"CAUCA","BUENOS AIRES",19110,"CESAR","BOSCONIA",20060,"CHOCÓ","BAHÍA SOLANO",27075,"CÓRDOBA","CHIMÁ",23168,"CUNDINAMARCA","BELTRÁN",25086,"GUAINÍA","LA GUADALUPE",94885,"HUILA","ALTAMIRA",41026,"LA_GUAJIRA","EL MOLINO",44110,"MAGDALENA","CHIBOLO",47170,"META","CUBARRAL",50223,"NARIÑO","BARBACOAS",52079,"NORTE_DE_SANTANDER","CÁCOTA",54125,"PUTUMAYO","PUERTO GUZMÁN",86571,"QUINDIO","FILANDIA",63272,"RISARALDA","GUÁTICA",66318,"SANTANDER","BARICHARA",68079,"SUCRE","COVEÑAS",70221,"TOLIMA","ARMERO",73055,"VALLE_DEL_CAUCA","BOLÍVAR",19100,"VAUPÉS","YAVARATÉ",97889]
["BOYACÁ",7,"AMAZONAS","MIRITÍ - PARANÁ",91460,"ANTIOQUIA","ANDES",5034,"ARAUCA","TAME",81794,"ATLÁNTICO","LURUACO",8421,null,null,null,"BOLÍVAR","BARRANCO DE LOBA",13074,"BOYACÁ","BETÉITIVA",15092,"CALDAS","FILADELFIA",17272,"CAQUETÁ","EL PAUJIL",18256,"CASANARE","MONTERREY",85162,"CAUCA","CAJIBÍO",19130,"CESAR","CHIMICHAGUA",20175,"CHOCÓ","BAJO BAUDÓ",27077,"CÓRDOBA","CHINÚ",23182,"CUNDINAMARCA","BITUIMA",25095,"GUAINÍA","CACAHUAL",94886,"HUILA","BARAYA",41078,"LA_GUAJIRA","FONSECA",44279,"MAGDALENA","CIÉNAGA",47189,"META","CUMARAL",50226,"NARIÑO","BELÉN",15087,"NORTE_DE_SANTANDER","CACHIRÁ",54128,"PUTUMAYO","PUERTO LEGUÍZAMO",{"$error":"#N/A"},"QUINDIO","GÉNOVA",63302,"RISARALDA","LA CELIA",66383,"SANTANDER","BARRANCABERMEJA",68081,"SUCRE","CHALÁN",70230,"TOLIMA","ATACO",73067,"VALLE_DEL_CAUCA","BUENAVENTURA",76109,"VICHADA","PUERTO CARREÑO",99001]
["CALDAS",8,"AMAZONAS","PUERTO ALEGRÍA",91530,"ANTIOQUIA","ANGELÓPOLIS",5036,"SAN_ANDRÉS","SAN ANDRÉS",88001,"ATLÁNTICO","MALAMBO",8433,null,null,null,"BOLÍVAR","CALAMAR",13140,"BOYACÁ","BOAVITA",15097,"CALDAS","LA DORADA",17380,"CAQUETÁ","LA MONTAÑITA",18410,"CASANARE","NUNCHÍA",85225,"CAUCA","CALDONO",19137,"CESAR","CHIRIGUANÁ",20178,"CHOCÓ","BOJAYA",27099,"CÓRDOBA","CIÉNAGA DE ORO",23189,"CUNDINAMARCA","BOJACÁ",25099,"GUAINÍA","PANA PANA",94887,"HUILA","CAMPOALEGRE",41132,"LA_GUAJIRA","HATO NUEVO",44378,"MAGDALENA","CONCORDIA",5209,"META","EL CALVARIO",50245,"NARIÑO","BUESACO",52110,"NORTE_DE_SANTANDER","CHINÁCOTA",54172,"PUTUMAYO","SIBUNDOY",86749,"QUINDIO","LA TEBAIDA",63401,"RISARALDA","LA VIRGINIA",66400,"SANTANDER","BETULIA",5093,"SUCRE","EL ROBLE",70233,"TOLIMA","CAJAMARCA",73124,"VALLE_DEL_CAUCA","GUADALAJARA DE BUGA",76111,"VICHADA","LA PRIMAVERA",99524]
["CAQUETÁ",9,"AMAZONAS","PUERTO ARICA",91536,"ANTIOQUIA","ANGOSTURA",5038,"SAN_ANDRÉS","PROVIDENCIA",52565,"ATLÁNTICO","MANATÍ",8436,null,null,null,"BOLÍVAR","CANTAGALLO",13160,"BOYACÁ","BOYACÁ",15104,"CALDAS","LA MERCED",17388,"CAQUETÁ","MILÁN",18460,"CASANARE","OROCUÉ",85230,"CAUCA","CALOTO",19142,"CESAR","CURUMANÍ",20228,"CHOCÓ","EL CANTÓN DEL SAN PABLO",27135,"CÓRDOBA","COTORRA",23300,"CUNDINAMARCA","CABRERA",25120,"GUAINÍA","MORICHAL",94888,"HUILA","COLOMBIA",41206,"LA_GUAJIRA","LA JAGUA DEL PILAR",44420,"MAGDALENA","EL BANCO",47245,"META","EL CASTILLO",50251,"NARIÑO","COLÓN",52203,"NORTE_DE_SANTANDER","CHITAGÁ",54174,"PUTUMAYO","SAN FRANCISCO",5652,"QUINDIO","MONTENEGRO",63470,"RISARALDA","MARSELLA",66440,"SANTANDER","BOLÍVAR",19100,"SUCRE","GALERAS",70235,"TOLIMA","CARMEN DE APICALÁ",73148,"VALLE_DEL_CAUCA","BUGALAGRANDE",76113,"VICHADA","SANTA ROSALÍA",99624]
["CASANARE",10,"AMAZONAS","PUERTO NARIÑO",91540,"ANTIOQUIA","ANORÍ",5040,null,null,null,"ATLÁNTICO","PALMAR DE VARELA",8520,null,null,null,"BOLÍVAR","CICUCO",13188,"BOYACÁ","BRICEÑO",5107,"CALDAS","MANZANARES",17433,"CAQUETÁ","MORELIA",18479,"CASANARE","PAZ DE ARIPORO",85250,"CAUCA","CORINTO",19212,"CESAR","EL COPEY",20238,"CHOCÓ","CARMEN DEL DARIEN",27150,"CÓRDOBA","LA APARTADA",23350,"CUNDINAMARCA","CACHIPAY",25123,"GUAVIARE","SAN JOSÉ DEL GUAVIARE",95001,"HUILA","ELÍAS",41244,"LA_GUAJIRA","MAICAO",44430,"MAGDALENA","EL PIÑON",47258,"META","EL DORADO",50270,"NARIÑO","CONSACA",52207,"NORTE_DE_SANTANDER","CONVENCIÓN",54206,"PUTUMAYO","SAN MIGUEL",86757,"QUINDIO","PIJAO",63548,"RISARALDA","MISTRATÓ",66456,"SANTANDER","CABRERA",25120,"SUCRE","GUARANDA",70265,"TOLIMA","CASABIANCA",73152,"VALLE_DEL_CAUCA","CAICEDONIA",76122,"VICHADA","CUMARIBO",99773]
["CAUCA",11,"AMAZONAS","PUERTO SANTANDER",91669,"ANTIOQUIA","SANTA FÉ DE ANTIOQUIA",5042,null,null,null,"ATLÁNTICO","PIOJÓ",8549,null,null,null,"BOLÍVAR","CÓRDOBA",13212,"BOYACÁ","BUENAVISTA",15109,"CALDAS","MARMATO",17442,"CAQUETÁ","PUERTO RICO",18592,"CASANARE","PORE",85263,"CAUCA","EL TAMBO",19256,"CESAR","EL PASO",20250,"CHOCÓ","CÉRTEGUI",27160,"CÓRDOBA","LORICA",23417,"CUNDINAMARCA","CAJICÁ",25126,"GUAVIARE","CALAMAR",13140,"HUILA","GARZÓN",41298,"LA_GUAJIRA","MANAURE",20443,"MAGDALENA","EL RETÉN",47268,"META","FUENTE DE ORO",50287,"NARIÑO","CONTADERO",52210,"NORTE_DE_SANTANDER","CUCUTILLA",54223,"PUTUMAYO","SANTIAGO",54680,"QUINDIO","QUIMBAYA",63594,"RISARALDA","PUEBLO RICO",66572,"SANTANDER","CALIFORNIA",68132,"SUCRE","LA UNIÓN",5400,"TOLIMA","CHAPARRAL",73168,"VALLE_DEL_CAUCA","CALIMA",76126]
["CESAR",12,"AMAZONAS","TARAPACÁ",91798,"ANTIOQUIA","ANZÁ",5044,null,null,null,"ATLÁNTICO","POLONUEVO",8558,null,null,null,"BOLÍVAR","CLEMENCIA",13222,"BOYACÁ","BUSBANZÁ",15114,"CALDAS","MARQUETALIA",17444,"CAQUETÁ","SAN JOSÉ DEL FRAGUA",18610,"CASANARE","RECETOR",85279,"CAUCA","FLORENCIA",18001,"CESAR","GAMARRA",20295,"CHOCÓ","CONDOTO",27205,"CÓRDOBA","LOS CÓRDOBAS",23419,"CUNDINAMARCA","CAPARRAPÍ",25148,"GUAVIARE","EL RETORNO",95025,"HUILA","GIGANTE",41306,"LA_GUAJIRA","SAN JUAN DEL CESAR",44650,"MAGDALENA","FUNDACIÓN",47288,"META","GRANADA",5313,"NARIÑO","CÓRDOBA",13212,"NORTE_DE_SANTANDER","DURANIA",54239,"PUTUMAYO","VALLE DEL GUAMUEZ",86865,"QUINDIO","SALENTO",63690,"RISARALDA","QUINCHÍA",66594,"SANTANDER","CAPITANEJO",68147,"SUCRE","LOS PALMITOS",70418,"TOLIMA","COELLO",73200,"VALLE_DEL_CAUCA","CANDELARIA",8141]
["CHOCÓ",13,null,null,null,"ANTIOQUIA","APARTADÓ",5045,null,null,null,"ATLÁNTICO","PONEDERA",8560,null,null,null,"BOLÍVAR","EL CARMEN DE BOLÍVAR",13244,"BOYACÁ","CALDAS",5129,"CALDAS","MARULANDA",17446,"CAQUETÁ","SAN VICENTE DEL CAGUÁN",18753,"CASANARE","SABANALARGA",5628,"CAUCA","GUACHENÉ",19300,"CESAR","GONZÁLEZ",20310,"CHOCÓ","EL CARMEN DE ATRATO",27245,"CÓRDOBA","MOMIL",23464,"CUNDINAMARCA","CÁQUEZA",25151,"GUAVIARE","MIRAFLORES",15455,"HUILA","GUADALUPE",5315,"LA_GUAJIRA","URIBIA",44847,"MAGDALENA","GUAMAL",47318,"META","GUAMAL",47318,"NARIÑO","CUASPUD",52224,"NORTE_DE_SANTANDER","EL CARMEN",54245,"PUTUMAYO","VILLAGARZÓN",86885,null,null,null,"RISARALDA","SANTA ROSA DE CABAL",66682,"SANTANDER","CARCASÍ",68152,"SUCRE","MAJAGUAL",70429,"TOLIMA","COYAIMA",73217,"VALLE_DEL_CAUCA","CARTAGO",76147]
["CÓRDOBA",14,null,null,null,"ANTIOQUIA","ARBOLETES",5051,null,null,null,"ATLÁNTICO","PUERTO COLOMBIA",8573,null,null,null,"BOLÍVAR","EL GUAMO",13248,"BOYACÁ","CAMPOHERMOSO",15135,"CALDAS","NEIRA",17486,"CAQUETÁ","SOLANO",18756,"CASANARE","SÁCAMA",85315,"CAUCA","GUAPI",19318,"CESAR","LA GLORIA",20383,"CHOCÓ","EL LITORAL DEL SAN JUAN",27250,"CÓRDOBA","MONTELÍBANO",23466,"CUNDINAMARCA","CARMEN DE CARUPA",25154,null,null,null,"HUILA","HOBO",41349,"LA_GUAJIRA","URUMITA",44855,"MAGDALENA","NUEVA GRANADA",47460,"META","MAPIRIPÁN",50325,"NARIÑO","CUMBAL",52227,"NORTE_DE_SANTANDER","EL TARRA",54250,null,null,null,null,null,null,"RISARALDA","SANTUARIO",66687,"SANTANDER","CEPITÁ",68160,"SUCRE","MORROA",70473,"TOLIMA","CUNDAY",73226,"VALLE_DEL_CAUCA","DAGUA",76233]
["CUNDINAMARCA",15,null,null,null,"ANTIOQUIA","ARGELIA",5055,null,null,null,"ATLÁNTICO","REPELÓN",8606,null,null,null,"BOLÍVAR","EL PEÑÓN",13268,"BOYACÁ","CERINZA",15162,"CALDAS","NORCASIA",17495,"CAQUETÁ","SOLITA",18785,"CASANARE","SAN LUIS DE PALENQUE",85325,"CAUCA","INZÁ",19355,"CESAR","LA JAGUA DE IBIRICO",20400,"CHOCÓ","ISTMINA",27361,"CÓRDOBA","MOÑITOS",23500,"CUNDINAMARCA","CHAGUANÍ",25168,null,null,null,"HUILA","IQUIRA",41357,"LA_GUAJIRA","VILLANUEVA",13873,"MAGDALENA","PEDRAZA",47541,"META","MESETAS",50330,"NARIÑO","CUMBITARA",52233,"NORTE_DE_SANTANDER","EL ZULIA",54261,null,null,null,null,null,null,null,null,null,"SANTANDER","CERRITO",68162,"SUCRE","OVEJAS",70508,"TOLIMA","DOLORES",73236,"VALLE_DEL_CAUCA","EL ÁGUILA",76243]
["GUAINÍA",16,null,null,null,"ANTIOQUIA","ARMENIA",5059,null,null,null,"ATLÁNTICO","SABANAGRANDE",8634,null,null,null,"BOLÍVAR","HATILLO DE LOBA",13300,"BOYACÁ","CHINAVITA",15172,"CALDAS","PÁCORA",17513,"CAQUETÁ","VALPARAÍSO",18860,"CASANARE","TÁMARA",85400,"CAUCA","JAMBALÓ",19364,"CESAR","MANAURE",20443,"CHOCÓ","JURADÓ",27372,"CÓRDOBA","PLANETA RICA",23555,"CUNDINAMARCA","CHÍA",25175,null,null,null,"HUILA","ISNOS",41359,null,null,null,"MAGDALENA","PIJIÑO DEL CARMEN",47545,"META","LA MACARENA",50350,"NARIÑO","CHACHAGÜÍ",52240,"NORTE_DE_SANTANDER","GRAMALOTE",54313,null,null,null,null,null,null,null,null,null,"SANTANDER","CHARALÁ",68167,"SUCRE","PALMITO",70523,"TOLIMA","ESPINAL",73268,"VALLE_DEL_CAUCA","EL CAIRO",76246]
["GUAVIARE",17,null,null,null,"ANTIOQUIA","BARBOSA",5079,null,null,null,"ATLÁNTICO","SABANALARGA",5628,null,null,null,"BOLÍVAR","MAGANGUÉ",13430,"BOYACÁ","CHIQUINQUIRÁ",15176,"CALDAS","PALESTINA",17524,null,null,null,"CASANARE","TAURAMENA",85410,"CAUCA","LA SIERRA",19392,"CESAR","PAILITAS",20517,"CHOCÓ","LLORÓ",27413,"CÓRDOBA","PUEBLO NUEVO",23570,"CUNDINAMARCA","CHIPAQUE",25178,null,null,null,"HUILA","LA ARGENTINA",41378,null,null,null,"MAGDALENA","PIVIJAY",47551,"META","URIBE",50370,"NARIÑO","EL CHARCO",52250,"NORTE_DE_SANTANDER","HACARÍ",54344,null,null,null,null,null,null,null,null,null,"SANTANDER","CHARTA",68169,"SUCRE","SAMPUÉS",70670,"TOLIMA","FALAN",73270,"VALLE_DEL_CAUCA","EL CERRITO",76248]
["HUILA",18,null,null,null,"ANTIOQUIA","BELMIRA",5086,null,null,null,"ATLÁNTICO","SANTA LUCÍA",8675,null,null,null,"BOLÍVAR","MAHATES",13433,"BOYACÁ","CHISCAS",15180,"CALDAS","PENSILVANIA",17541,null,null,null,"CASANARE","TRINIDAD",85430,"CAUCA","LA VEGA",19397,"CESAR","PELAYA",20550,"CHOCÓ","MEDIO ATRATO",27425,"CÓRDOBA","PUERTO ESCONDIDO",23574,"CUNDINAMARCA","CHOACHÍ",25181,null,null,null,"HUILA","LA PLATA",41396,null,null,null,"MAGDALENA","PLATO",47555,"META","LEJANÍAS",50400,"NARIÑO","EL PEÑOL",52254,"NORTE_DE_SANTANDER","HERRÁN",54347,null,null,null,null,null,null,null,null,null,"SANTANDER","CHIMA",68176,"SUCRE","SAN BENITO ABAD",70678,"TOLIMA","FLANDES",73275,"VALLE_DEL_CAUCA","EL DOVIO",76250]
["LA_GUAJIRA",19,null,null,null,"ANTIOQUIA","BELLO",5088,null,null,null,"ATLÁNTICO","SANTO TOMÁS",8685,null,null,null,"BOLÍVAR","MARGARITA",13440,"BOYACÁ","CHITA",15183,"CALDAS","RIOSUCIO",17614,null,null,null,"CASANARE","VILLANUEVA",13873,"CAUCA","LÓPEZ",19418,"CESAR","PUEBLO BELLO",20570,"CHOCÓ","MEDIO BAUDÓ",27430,"CÓRDOBA","PUERTO LIBERTADOR",23580,"CUNDINAMARCA","CHOCONTÁ",25183,null,null,null,"HUILA","NÁTAGA",41483,null,null,null,"MAGDALENA","PUEBLOVIEJO",47570,"META","PUERTO CONCORDIA",50450,"NARIÑO","EL ROSARIO",52256,"NORTE_DE_SANTANDER","LABATECA",54377,null,null,null,null,null,null,null,null,null,"SANTANDER","CHIPATÁ",68179,"SUCRE","SAN JUAN DE BETULIA",70702,"TOLIMA","FRESNO",73283,"VALLE_DEL_CAUCA","FLORIDA",76275]
{"$rows_left_out":1092}